Reaction Details
TargetcAMP and cAMP-inhibited cGMP 3',5'-cyclic phosphodiesterase 10A
LigandBDBM50124641
Substrate/Competitorn/a
Meas. Tech.ChEMBL_1520899 (CHEMBL3626399)
Ki 5.1±n/a nM
Citation Shipe, WDSharik, SSBarrow, JCMcGaughey, GBTheberge, CRUslaner, JMYan, YRenger, JJSmith, SMColeman, PJCox, CD Discovery and Optimization of a Series of Pyrimidine-Based Phosphodiesterase 10A (PDE10A) Inhibitors through Fragment Screening, Structure-Based Design, and Parallel Synthesis. J Med Chem58:7888-94 (2015) 
 
cAMP and cAMP-inhibited cGMP 3',5'-cyclic phosphodiesterase 10A
Name:cAMP and cAMP-inhibited cGMP 3',5'-cyclic phosphodiesterase 10A
Type:Protein
Mol. Mass.:88412.52
Organism:Homo sapiens (Human)
Description:Q9Y233
Residue:779
BDBM50124641
NameBDBM50124641
Synonyms:CHEMBL3622891
TypeSmall organic molecule
Emp. Form.C14H19ClN4OS
Mol. Mass.326.845
SMILESCCCOc1nc(Cl)c(C)c(NCc2sc(C)nc2C)n1