Reaction Details
TargetcAMP and cAMP-inhibited cGMP 3',5'-cyclic phosphodiesterase 10A
LigandBDBM126827
Substrate/Competitorn/a
Meas. Tech.ChEMBL_1520899 (CHEMBL3626399)
Ki 0.040000±n/a nM
Citation Shipe, WDSharik, SSBarrow, JCMcGaughey, GBTheberge, CRUslaner, JMYan, YRenger, JJSmith, SMColeman, PJCox, CD Discovery and Optimization of a Series of Pyrimidine-Based Phosphodiesterase 10A (PDE10A) Inhibitors through Fragment Screening, Structure-Based Design, and Parallel Synthesis. J Med Chem58:7888-94 (2015) 
 
cAMP and cAMP-inhibited cGMP 3',5'-cyclic phosphodiesterase 10A
Name:cAMP and cAMP-inhibited cGMP 3',5'-cyclic phosphodiesterase 10A
Type:Protein
Mol. Mass.:88412.52
Organism:Homo sapiens (Human)
Description:Q9Y233
Residue:779
BDBM126827
NameBDBM126827
Synonyms:US8785467, 1-32
TypeSmall organic molecule
Emp. Form.C21H21ClN6O2S
Mol. Mass.456.948
SMILESCc1nc(C)c(CNc2nc(OCCOc3ccc4cccnc4n3)nc(Cl)c2C)s1