Reaction Details
TargetAcetylcholinesterase
LigandBDBM50124879
Substrate/Competitorn/a
Meas. Tech.ChEMBL_1521650 (CHEMBL3626450)
IC50 2.8±n/a nM
Citation Camerino, EWong, DMTong, FKörber, FGross, ADIslam, RViayna, EMutunga, JMLi, JTotrov, MMBloomquist, JRCarlier, PR Difluoromethyl ketones: Potent inhibitors of wild type and carbamate-insensitive G119S mutant Anopheles gambiae acetylcholinesterase. Bioorg Med Chem Lett25:4405-11 (2015) 
 
Acetylcholinesterase
Name:Acetylcholinesterase
Type:PROTEIN
Mol. Mass.:80902.47
Organism:Anopheles gambiae
Description:ChEMBL_104567
Residue:737
BDBM50124879
NameBDBM50124879
Synonyms:CHEMBL3623551
TypeSmall organic molecule
Emp. Form.C10H13F3N2O
Mol. Mass.234.2182
SMILESCCC(CC)n1cc(cn1)C(=O)C(F)(F)F