Reaction Details
TargetAcetylcholinesterase
LigandBDBM50124876
Substrate/Competitorn/a
Meas. Tech.ChEMBL_1521650 (CHEMBL3626450)
IC50 9.1±n/a nM
Citation Camerino, EWong, DMTong, FKörber, FGross, ADIslam, RViayna, EMutunga, JMLi, JTotrov, MMBloomquist, JRCarlier, PR Difluoromethyl ketones: Potent inhibitors of wild type and carbamate-insensitive G119S mutant Anopheles gambiae acetylcholinesterase. Bioorg Med Chem Lett25:4405-11 (2015) 
 
Acetylcholinesterase
Name:Acetylcholinesterase
Type:PROTEIN
Mol. Mass.:80902.47
Organism:Anopheles gambiae
Description:ChEMBL_104567
Residue:737
BDBM50124876
NameBDBM50124876
Synonyms:CHEMBL3623554
TypeSmall organic molecule
Emp. Form.C12H14F2O
Mol. Mass.212.2358
SMILESCC(C)(C)c1cccc(c1)C(=O)C(F)F