Reaction Details
TargetAcetylcholinesterase
LigandBDBM50124895
Substrate/Competitorn/a
Meas. Tech.ChEMBL_1521850 (CHEMBL3626751)
Ki 1.6±n/a nM
Citation Camerino, EWong, DMTong, FKörber, FGross, ADIslam, RViayna, EMutunga, JMLi, JTotrov, MMBloomquist, JRCarlier, PR Difluoromethyl ketones: Potent inhibitors of wild type and carbamate-insensitive G119S mutant Anopheles gambiae acetylcholinesterase. Bioorg Med Chem Lett25:4405-11 (2015) 
 
Acetylcholinesterase
Name:Acetylcholinesterase
Type:Enzyme
Mol. Mass.:71812.79
Organism:Electrophorus electricus (Electric eel)
Description:n/a
Residue:633
BDBM50124895
NameBDBM50124895
Synonyms:CHEMBL3623568
TypeSmall organic molecule
Emp. Form.C9H16F2O
Mol. Mass.178.2195
SMILESCC(=O)C(F)(F)CCC(C)(C)C