Reaction Details
TargetHistone-lysine N-methyltransferase SETD7
LigandBDBM50124897
Substrate/Competitorn/a
Meas. Tech.ChEMBL_1521870 (CHEMBL3626816)
IC50 89180±n/a nM
Citation Meng, FCheng, SDing, HLiu, SLiu, YZhu, KChen, SLu, JXie, YLi, LLiu, RShi, ZZhou, YLiu, YCZheng, MJiang, HLu, WLiu, HLuo, C Discovery and Optimization of Novel, Selective Histone Methyltransferase SET7 Inhibitors by Pharmacophore- and Docking-Based Virtual Screening. J Med Chem58:8166-81 (2015) 
 
Histone-lysine N-methyltransferase SETD7
Name:Histone-lysine N-methyltransferase SETD7
Type:Enzyme
Mol. Mass.:40691.12
Organism:Homo sapiens (Human)
Description:Q8WTS6
Residue:366
BDBM50124897
NameBDBM50124897
Synonyms:CHEMBL3623578
TypeSmall organic molecule
Emp. Form.C12H10N2O4
Mol. Mass.246.2188
SMILESCc1cc(co1)C(=O)Nc1cccc(c1)[N+]([O-])=O