Reaction Details
TargetHistone-lysine N-methyltransferase SETD7
LigandBDBM50124903
Substrate/Competitorn/a
Meas. Tech.ChEMBL_1521870 (CHEMBL3626816)
IC50 49520±n/a nM
Citation Meng, FCheng, SDing, HLiu, SLiu, YZhu, KChen, SLu, JXie, YLi, LLiu, RShi, ZZhou, YLiu, YCZheng, MJiang, HLu, WLiu, HLuo, C Discovery and Optimization of Novel, Selective Histone Methyltransferase SET7 Inhibitors by Pharmacophore- and Docking-Based Virtual Screening. J Med Chem58:8166-81 (2015) 
 
Histone-lysine N-methyltransferase SETD7
Name:Histone-lysine N-methyltransferase SETD7
Type:Enzyme
Mol. Mass.:40691.12
Organism:Homo sapiens (Human)
Description:Q8WTS6
Residue:366
BDBM50124903
NameBDBM50124903
Synonyms:CHEMBL3623753
TypeSmall organic molecule
Emp. Form.C14H12N4O6S
Mol. Mass.364.333
SMILESCc1c(sc(N)c1C(=O)OC(N)=O)C(=O)Nc1cccc(c1)[N+]([O-])=O