Reaction Details
TargetKallikrein-14
LigandBDBM50124906
Substrate/Competitorn/a
Meas. Tech.ChEMBL_1522073 (CHEMBL3627278)
Ki 0.400000±n/a nM
Citation de Veer, SJWang, CKHarris, JMCraik, DJSwedberg, JE Improving the Selectivity of Engineered Protease Inhibitors: Optimizing the P2 Prime Residue Using a Versatile Cyclic Peptide Library. J Med Chem58:8257-68 (2015) 
 
Kallikrein-14
Name:Kallikrein-14
Type:PROTEIN
Mol. Mass.:29136.99
Organism:Homo sapiens (Human)
Description:ChEMBL_1282452
Residue:267
BDBM50124906
NameBDBM50124906
Synonyms:CHEMBL3623776
TypeSmall organic molecule
Emp. Form.C60H97N19O19S2
Mol. Mass.1452.658
SMILES[H][C@@]12CCCN1C(=O)[C@H](CC(N)=O)NC(=O)[C@]1([H])CSSC[C@]([H])(NC(=O)[C@@]([H])(NC(=O)CNC(=O)[C@H](CC(N)=O)NC2=O)[C@@H](C)O)C(=O)N[C@@]([H])([C@@H](C)O)C(=O)N[C@@H](CCCNC(N)=N)C(=O)N[C@@H](CO)C(=O)N[C@@]([H])([C@@H](C)CC)C(=O)N2CCC[C@@]2([H])C(=O)N2CCC[C@@]2([H])C(=O)N[C@@]([H])([C@@H](C)CC)C(=O)N1