Reaction Details
TargetProgesterone receptor
LigandBDBM50169743
Substrate/Competitorn/a
Meas. Tech.ChEMBL_1519263 (CHEMBL3624760)
IC50<100000±n/a nM
Citation De Savi, CBradbury, RHRabow, AANorman, RAde Almeida, CAndrews, DMBallard, PButtar, DCallis, RJCurrie, GSCurwen, JODavies, CDDonald, CSFeron, LJGingell, HGlossop, SCHayter, BRHussain, SKaroutchi, GLamont, SGMacFaul, PMoss, TAPearson, SETonge, MWalker, GEWeir, HMWilson, Z Optimization of a Novel Binding Motif to (E)-3-(3,5-Difluoro-4-((1R,3R)-2-(2-fluoro-2-methylpropyl)-3-methyl-2,3,4,9-tetrahydro-1H-pyrido[3,4-b]indol-1-yl)phenyl)acrylic Acid (AZD9496), a Potent and Orally Bioavailable Selective Estrogen Receptor Downregulator and Antagonist. J Med Chem58:8128-40 (2015) 
 
Progesterone receptor
Name:Progesterone receptor
Type:Protein
Mol. Mass.:98979.52
Organism:Homo sapiens (Human)
Description:P06401
Residue:933
BDBM50169743
NameBDBM50169743
Synonyms:(13S,17S)-13-Methyl-7-[9-(4,4,5,5,5-pentafluoro-pentane-1-sulfinyl)-nonyl]-7,8,9,11,12,13,14,15,16,17-decahydro-6H-cyclopenta[a]phenanthrene-3,17-diol (7R,13S,17S)-13-methyl-7-(9-(4,4,5,5,5-pentafluoropentylsulfinyl)nonyl)-7,8,9,11,12,13,14,15,16,17-decahydro-6H-cyclopenta[a]phenanthrene-3,17-diol (7R,8R,9S,13S,14S,17S)-13-methyl-7-(9-(4,4,5,5,5-pentafluoropentyldihydrosulfinyl)nonyl)-7,8,9,11,12,13,14,15,16,17-decahydro-6H-cyclopenta[a]phenanthrene-3,17-diol 13-Methyl-7-[9-(4,4,5,5,5-pentafluoro-pentane-1-sulfinyl)-nonyl]-7,8,9,11,12,13,14,15,16,17-decahydro-6H-cyclopenta[a]phenanthrene-3,17-diol FULVESTRANT Fluvestrant US10227334, Fulvestrant | ZD-9238
TypeSmall organic molecule
Emp. Form.C32H47F5O3S
Mol. Mass.606.771
SMILESC[C@]12CC[C@H]3[C@H]([C@@H]1CC[C@@H]2O)[C@H](CCCCCCCCCS(=O)CCCC(F)(F)C(F)(F)F)Cc1cc(O)ccc31