Reaction Details
TargetPeptidyl-prolyl cis-trans isomerase FKBP5
LigandBDBM50125323
Substrate/Competitorn/a
Meas. Tech.ChEMBL_1519315 (CHEMBL3624906)
Ki 2100±n/a nM
Citation Feng, XSippel, CBracher, AHausch, F Structure-Affinity Relationship Analysis of Selective FKBP51 Ligands. J Med Chem58:7796-806 (2015) 
 
Peptidyl-prolyl cis-trans isomerase FKBP5
Name:Peptidyl-prolyl cis-trans isomerase FKBP5
Type:PROTEIN
Mol. Mass.:51207.06
Organism:Homo sapiens (Human)
Description:ChEMBL_952910
Residue:457
BDBM50125323
NameBDBM50125323
Synonyms:CHEMBL3623621
TypeSmall organic molecule
Emp. Form.C40H56N2O9
Mol. Mass.708.8806
SMILESCOc1ccc(CC[C@@H](OC(=O)[C@@H]2CCCCN2C(=O)[C@H](COC(C)=O)C2CCCCC2)c2cccc(OCCN3CCOCC3)c2)cc1OC