Reaction Details
TargetPeptidyl-prolyl cis-trans isomerase FKBP5
LigandBDBM50125327
Substrate/Competitorn/a
Meas. Tech.ChEMBL_1519315 (CHEMBL3624906)
Ki 1200±n/a nM
Citation Feng, XSippel, CBracher, AHausch, F Structure-Affinity Relationship Analysis of Selective FKBP51 Ligands. J Med Chem58:7796-806 (2015) 
 
Peptidyl-prolyl cis-trans isomerase FKBP5
Name:Peptidyl-prolyl cis-trans isomerase FKBP5
Type:PROTEIN
Mol. Mass.:51207.06
Organism:Homo sapiens (Human)
Description:ChEMBL_952910
Residue:457
BDBM50125327
NameBDBM50125327
Synonyms:CHEMBL3623617
TypeSmall organic molecule
Emp. Form.C34H45NO8
Mol. Mass.595.723
SMILESCOc1ccc(CC[C@@H](OC(=O)[C@@H]2CCCCN2C(=O)[C@H](C)C2CCCCC2)c2cccc(OCC(O)=O)c2)cc1OC