Reaction Details
TargetPeptidyl-prolyl cis-trans isomerase FKBP4
LigandBDBM50125332
Substrate/Competitorn/a
Meas. Tech.ChEMBL_1519316 (CHEMBL3624907)
Ki>50000±n/a nM
Citation Feng, XSippel, CBracher, AHausch, F Structure-Affinity Relationship Analysis of Selective FKBP51 Ligands. J Med Chem58:7796-806 (2015) 
 
Peptidyl-prolyl cis-trans isomerase FKBP4
Name:Peptidyl-prolyl cis-trans isomerase FKBP4
Type:PROTEIN
Mol. Mass.:51793.87
Organism:Homo sapiens (Human)
Description:ChEMBL_154482
Residue:459
BDBM50125332
NameBDBM50125332
Synonyms:CHEMBL3623613
TypeSmall organic molecule
Emp. Form.C41H51NO10
Mol. Mass.717.8443
SMILESCOc1cc(OC)cc(c1)[C@H](C1CCCCC1)C(=O)N1CCCC[C@H]1C(=O)O[C@H](CCc1ccc(OC)c(OC)c1)c1cccc(OCC(O)=O)c1