Reaction Details
TargetCarbonic anhydrase 9
LigandBDBM50125408
Substrate/Competitorn/a
Meas. Tech.ChEMBL_1519321 (CHEMBL3624912)
Ki 250±n/a nM
Citation Esirden, IUlus, RAday, BTanç, MSupuran, CTKaya, M Synthesis of novel acridine bis-sulfonamides with effective inhibitory activity against the carbonic anhydrase isoforms I, II, IX and XII. Bioorg Med Chem23:6573-80 (2015) 
 
Carbonic anhydrase 9
Name:Carbonic anhydrase 9
Type:Enzyme
Mol. Mass.:49669.03
Organism:Homo sapiens (Human)
Description:Catalytic domain of human cloned isozyme was used in the assay
Residue:459
BDBM50125408
NameBDBM50125408
Synonyms:CHEMBL3623644
TypeSmall organic molecule
Emp. Form.C35H36BrN3O6S2
Mol. Mass.738.711
SMILESCC1(C)CC(=O)C2=C(C1)N(C1=C(C2c2cccc(NS(=O)(=O)c3ccc(Br)cc3)c2)C(=O)CC(C)(C)C1)c1ccc(cc1)S(N)(=O)=O