Reaction Details
TargetCarbonic anhydrase 12
LigandBDBM50125569
Substrate/Competitorn/a
Meas. Tech.ChEMBL_1519322 (CHEMBL3624913)
Ki 350±n/a nM
Citation Esirden, IUlus, RAday, BTanç, MSupuran, CTKaya, M Synthesis of novel acridine bis-sulfonamides with effective inhibitory activity against the carbonic anhydrase isoforms I, II, IX and XII. Bioorg Med Chem23:6573-80 (2015) 
 
Carbonic anhydrase 12
Name:Carbonic anhydrase 12
Type:Enzyme
Mol. Mass.:39456.00
Organism:Homo sapiens (Human)
Description:Catalytic domain of human cloned isozyme was used in the assay
Residue:354
BDBM50125569
NameBDBM50125569
Synonyms:CHEMBL3623631
TypeSmall organic molecule
Emp. Form.C29H31N3O6S
Mol. Mass.549.638
SMILESCC1(C)CC(=O)C2=C(C1)N(C1=C(C2c2ccc(cc2)[N+]([O-])=O)C(=O)CC(C)(C)C1)c1ccc(cc1)S(N)(=O)=O