Reaction Details
TargetCarbonic anhydrase 12
LigandBDBM50125573
Substrate/Competitorn/a
Meas. Tech.ChEMBL_1519322 (CHEMBL3624913)
Ki 640±n/a nM
Citation Esirden, IUlus, RAday, BTanç, MSupuran, CTKaya, M Synthesis of novel acridine bis-sulfonamides with effective inhibitory activity against the carbonic anhydrase isoforms I, II, IX and XII. Bioorg Med Chem23:6573-80 (2015) 
 
Carbonic anhydrase 12
Name:Carbonic anhydrase 12
Type:Enzyme
Mol. Mass.:39456.00
Organism:Homo sapiens (Human)
Description:Catalytic domain of human cloned isozyme was used in the assay
Residue:354
BDBM50125573
NameBDBM50125573
Synonyms:CHEMBL3623635
TypeSmall organic molecule
Emp. Form.C35H37N3O6S2
Mol. Mass.659.815
SMILESCC1(C)CC(=O)C2=C(C1)N(C1=C(C2c2ccc(NS(=O)(=O)c3ccccc3)cc2)C(=O)CC(C)(C)C1)c1ccc(cc1)S(N)(=O)=O