Reaction Details
TargetCarbonic anhydrase 2
LigandBDBM50125572
Substrate/Competitorn/a
Meas. Tech.ChEMBL_1519320 (CHEMBL3624911)
Ki 500±n/a nM
Citation Esirden, IUlus, RAday, BTanç, MSupuran, CTKaya, M Synthesis of novel acridine bis-sulfonamides with effective inhibitory activity against the carbonic anhydrase isoforms I, II, IX and XII. Bioorg Med Chem23:6573-80 (2015) 
 
Carbonic anhydrase 2
Name:Carbonic anhydrase 2
Type:Enzyme
Mol. Mass.:29250.71
Organism:Homo sapiens (Human)
Description:P00918
Residue:260
BDBM50125572
NameBDBM50125572
Synonyms:CHEMBL3623634
TypeSmall organic molecule
Emp. Form.C29H33N3O4S
Mol. Mass.519.655
SMILESCC1(C)CC(=O)C2=C(C1)N(C1=C(C2c2cccc(N)c2)C(=O)CC(C)(C)C1)c1ccc(cc1)S(N)(=O)=O