Reaction Details
TargetCarbonic anhydrase 2
LigandBDBM50125367
Substrate/Competitorn/a
Meas. Tech.ChEMBL_1519320 (CHEMBL3624911)
Ki 470±n/a nM
Citation Esirden, IUlus, RAday, BTanç, MSupuran, CTKaya, M Synthesis of novel acridine bis-sulfonamides with effective inhibitory activity against the carbonic anhydrase isoforms I, II, IX and XII. Bioorg Med Chem23:6573-80 (2015) 
 
Carbonic anhydrase 2
Name:Carbonic anhydrase 2
Type:Enzyme
Mol. Mass.:29250.71
Organism:Homo sapiens (Human)
Description:P00918
Residue:260
BDBM50125367
NameBDBM50125367
Synonyms:CHEMBL3623640
TypeSmall organic molecule
Emp. Form.C39H39N3O6S2
Mol. Mass.709.873
SMILESCC1(C)CC(=O)C2=C(C1)N(C1=C(C2c2ccc(NS(=O)(=O)c3ccc4ccccc4c3)cc2)C(=O)CC(C)(C)C1)c1ccc(cc1)S(N)(=O)=O