Reaction Details
TargetCarbonic anhydrase 2
LigandBDBM50125584
Substrate/Competitorn/a
Meas. Tech.ChEMBL_1519335 (CHEMBL3625047)
Ki>10000±n/a nM
Citation Nocentini, ACarta, FCeruso, MBartolucci, GSupuran, CT Click-tailed coumarins with potent and selective inhibitory action against the tumor-associated carbonic anhydrases IX and XII. Bioorg Med Chem23:6955-66 (2015) 
 
Carbonic anhydrase 2
Name:Carbonic anhydrase 2
Type:Enzyme
Mol. Mass.:29250.71
Organism:Homo sapiens (Human)
Description:P00918
Residue:260
BDBM50125584
NameBDBM50125584
Synonyms:CHEMBL3623663
TypeSmall organic molecule
Emp. Form.C18H13N3O3
Mol. Mass.319.3141
SMILESO=c1ccc2ccc(OCc3cn(nn3)-c3ccccc3)cc2o1