Reaction Details
TargetCarbonic anhydrase 1
LigandBDBM50125583
Substrate/Competitorn/a
Meas. Tech.ChEMBL_1519334 (CHEMBL3625046)
Ki 921±n/a nM
Citation Nocentini, ACarta, FCeruso, MBartolucci, GSupuran, CT Click-tailed coumarins with potent and selective inhibitory action against the tumor-associated carbonic anhydrases IX and XII. Bioorg Med Chem23:6955-66 (2015) 
 
Carbonic anhydrase 1
Name:Carbonic anhydrase 1
Type:Enzyme
Mol. Mass.:28873.37
Organism:Homo sapiens (Human)
Description:P00915
Residue:261
BDBM50125583
NameBDBM50125583
Synonyms:CHEMBL3623664
TypeSmall organic molecule
Emp. Form.C18H12FN3O3
Mol. Mass.337.3046
SMILESFc1cccc(c1)-n1cc(COc2ccc3ccc(=O)oc3c2)nn1