Reaction Details
TargetCarbonic anhydrase 2
LigandBDBM50125678
Substrate/Competitorn/a
Meas. Tech.ChEMBL_1519335 (CHEMBL3625047)
Ki>10000±n/a nM
Citation Nocentini, ACarta, FCeruso, MBartolucci, GSupuran, CT Click-tailed coumarins with potent and selective inhibitory action against the tumor-associated carbonic anhydrases IX and XII. Bioorg Med Chem23:6955-66 (2015) 
 
Carbonic anhydrase 2
Name:Carbonic anhydrase 2
Type:Enzyme
Mol. Mass.:29250.71
Organism:Homo sapiens (Human)
Description:P00918
Residue:260
BDBM50125678
NameBDBM50125678
Synonyms:CHEMBL3623672
TypeSmall organic molecule
Emp. Form.C18H14N4O5S
Mol. Mass.398.393
SMILESNS(=O)(=O)c1ccc(cc1)-n1cc(COc2ccc3ccc(=O)oc3c2)nn1