Reaction Details
TargetCarbonic anhydrase 2
LigandBDBM50125588
Substrate/Competitorn/a
Meas. Tech.ChEMBL_1519335 (CHEMBL3625047)
Ki>10000±n/a nM
Citation Nocentini, ACarta, FCeruso, MBartolucci, GSupuran, CT Click-tailed coumarins with potent and selective inhibitory action against the tumor-associated carbonic anhydrases IX and XII. Bioorg Med Chem23:6955-66 (2015) 
 
Carbonic anhydrase 2
Name:Carbonic anhydrase 2
Type:Enzyme
Mol. Mass.:29250.71
Organism:Homo sapiens (Human)
Description:P00918
Residue:260
BDBM50125588
NameBDBM50125588
Synonyms:CHEMBL3623673
TypeSmall organic molecule
Emp. Form.C22H15N3O5
Mol. Mass.401.3716
SMILESCc1cc(=O)oc2cc(ccc12)-n1cc(COc2ccc3ccc(=O)oc3c2)nn1