Reaction Details
TargetCarbonic anhydrase 9
LigandBDBM50125585
Substrate/Competitorn/a
Meas. Tech.ChEMBL_1519336 (CHEMBL3625048)
Ki 34±n/a nM
Citation Nocentini, ACarta, FCeruso, MBartolucci, GSupuran, CT Click-tailed coumarins with potent and selective inhibitory action against the tumor-associated carbonic anhydrases IX and XII. Bioorg Med Chem23:6955-66 (2015) 
 
Carbonic anhydrase 9
Name:Carbonic anhydrase 9
Type:Enzyme
Mol. Mass.:49669.03
Organism:Homo sapiens (Human)
Description:Catalytic domain of human cloned isozyme was used in the assay
Residue:459
BDBM50125585
NameBDBM50125585
Synonyms:CHEMBL3623676
TypeSmall organic molecule
Emp. Form.C19H16N4O2
Mol. Mass.332.3559
SMILESCc1cc(=O)oc2cc(ccc12)-n1cc(CNc2ccccc2)nn1