Reaction Details
TargetC-X-C chemokine receptor type 4
LigandBDBM50125952
Substrate/Competitorn/a
Meas. Tech.ChEMBL_1522943 (CHEMBL3630975)
IC50 35±n/a nM
Citation Zhao, HProsser, ARLiotta, DCWilson, LJ Discovery of novel N-aryl piperazine CXCR4 antagonists. Bioorg Med Chem Lett25:4950-5 (2015) 
 
C-X-C chemokine receptor type 4
Name:C-X-C chemokine receptor type 4
Type:Enzyme
Mol. Mass.:39754.61
Organism:Homo sapiens (Human)
Description:P61073
Residue:352
BDBM50125952
NameBDBM50125952
Synonyms:CHEMBL3627798
TypeSmall organic molecule
Emp. Form.C23H33N5O2
Mol. Mass.411.5404
SMILESNCCCCN(C[C@@H]1CN(CCN1)C(=O)c1ccco1)[C@H]1CCCc2cccnc12