Reaction Details
TargetCoagulation factor IX
LigandBDBM50125981
Substrate/Competitorn/a
Meas. Tech.ChEMBL_1522950 (CHEMBL3630982)
Ki 10±n/a nM
Citation Zhang, TAndre, PBateman, TJChen, YHDesai, KEllsworth, KGeissler, WMGuo, LHruza, AJian, TMeng, DParker, DLQian, XReichert, PSherer, ECShu, MSmith, CJSonatore, LMTschirret-Guth, RNolting, AFOrr, RCampeau, LCAraki, KNishimura, TSakurada, IWood, HB Development of a novel class of potent and selective FIXa inhibitors. Bioorg Med Chem Lett25:4945-9 (2015) 
 
Coagulation factor IX
Name:Coagulation factor IX
Type:Enzyme
Mol. Mass.:51768.83
Organism:Homo sapiens (Human)
Description:P00740
Residue:461
BDBM50125981
NameBDBM50125981
Synonyms:CHEMBL3627901 | US10189819, Example 113
TypeSmall organic molecule
Emp. Form.C28H21Cl2F2N5O
Mol. Mass.552.402
SMILESCc1ncn(n1)-c1cc(Cl)c(C(=O)NC[C@@H](c2cccc(F)c2)c2ccc3c(C)ccc(F)c3n2)c(Cl)c1