Reaction Details
TargetCoagulation factor IX
LigandBDBM50125976
Substrate/Competitorn/a
Meas. Tech.ChEMBL_1522950 (CHEMBL3630982)
Ki 6.2±n/a nM
Citation Zhang, TAndre, PBateman, TJChen, YHDesai, KEllsworth, KGeissler, WMGuo, LHruza, AJian, TMeng, DParker, DLQian, XReichert, PSherer, ECShu, MSmith, CJSonatore, LMTschirret-Guth, RNolting, AFOrr, RCampeau, LCAraki, KNishimura, TSakurada, IWood, HB Development of a novel class of potent and selective FIXa inhibitors. Bioorg Med Chem Lett25:4945-9 (2015) 
 
Coagulation factor IX
Name:Coagulation factor IX
Type:Enzyme
Mol. Mass.:51768.83
Organism:Homo sapiens (Human)
Description:P00740
Residue:461
BDBM50125976
NameBDBM50125976
Synonyms:CHEMBL3627896
TypeSmall organic molecule
Emp. Form.C26H20Cl3FN6O
Mol. Mass.557.834
SMILESCc1ncn(n1)-c1cc(Cl)c(C(=O)NC[C@H](c2nc3c(C)cc(Cl)cc3[nH]2)c2cccc(F)c2)c(Cl)c1