Reaction Details
TargetE3 ubiquitin-protein ligase Mdm2
LigandBDBM50126114
Substrate/Competitorn/a
Meas. Tech.ChEMBL_1523259 (CHEMBL3629966)
Ki 3050±n/a nM
Citation Cominetti, MMGoffin, SARaffel, ETurner, KDRamoutar, JCO'Connell, MAHowell, LASearcey, M Identification of a new p53/MDM2 inhibitor motif inspired by studies of chlorofusin. Bioorg Med Chem Lett25:4878-80 (2015) 
 
E3 ubiquitin-protein ligase Mdm2
Name:E3 ubiquitin-protein ligase Mdm2
Type:Oncoprotein
Mol. Mass.:55196.54
Organism:Homo sapiens (Human)
Description:Q00987
Residue:491
BDBM50126114
NameBDBM50126114
Synonyms:CHEMBL3627743
TypeSmall organic molecule
Emp. Form.C29H28N4O4
Mol. Mass.496.557
SMILESCc1ccc(cc1)-c1cn(CCC[C@H](NC(=O)OCC2c3ccccc3-c3ccccc23)C(O)=O)nn1