Reaction Details
TargetIndoleamine 2,3-dioxygenase 1
LigandBDBM50126144
Substrate/Competitorn/a
Meas. Tech.ChEMBL_1523459 (CHEMBL3630803)
IC50<1000±n/a nM
Citation Dounay, ABTuttle, JBVerhoest, PR Challenges and Opportunities in the Discovery of New Therapeutics Targeting the Kynurenine Pathway. J Med Chem58:8762-82 (2015) 
 
Indoleamine 2,3-dioxygenase 1
Name:Indoleamine 2,3-dioxygenase 1
Type:Enzyme
Mol. Mass.:45330.80
Organism:Homo sapiens (Human)
Description:P14902
Residue:403
BDBM50126144
NameBDBM50126144
Synonyms:CHEMBL3629569 US10233190, Example 1304
TypeSmall organic molecule
Emp. Form.C18H22N2O
Mol. Mass.282.3801
SMILESOC(CC1c2ccccc2-c2cncn12)C1CCCCC1