Reaction Details
TargetCystine/glutamate transporter
LigandBDBM50376126
Substrate/Competitorn/a
Meas. Tech.ChEMBL_1523603 (CHEMBL3631402)
IC50 200±n/a nM
Citation Larraufie, MHYang, WSJiang, EThomas, AGSlusher, BSStockwell, BR Incorporation of metabolically stable ketones into a small molecule probe to increase potency and water solubility. Bioorg Med Chem Lett25:4787-92 (2015) 
 
Cystine/glutamate transporter
Name:Cystine/glutamate transporter
Type:PROTEIN
Mol. Mass.:55437.48
Organism:Homo sapiens (Human)
Description:ChEMBL_772170
Residue:501
BDBM50376126
NameBDBM50376126
Synonyms:ERASTIN
TypeSmall organic molecule
Emp. Form.C30H31ClN4O4
Mol. Mass.547.045
SMILESCCOc1ccccc1-n1c(nc2ccccc2c1=O)C(C)N1CCN(CC1)C(=O)COc1ccc(Cl)cc1