Reaction Details
TargetProtein mono-ADP-ribosyltransferase PARP10
LigandBDBM50339016
Substrate/Competitorn/a
Meas. Tech.ChEMBL_1523605 (CHEMBL3631404)
IC50 128825±n/a nM
Citation Morgan, RKCarter-O'Connell, ICohen, MS Selective inhibition of PARP10 using a chemical genetics strategy. Bioorg Med Chem Lett25:4770-3 (2015) 
 
Protein mono-ADP-ribosyltransferase PARP10
Name:Protein mono-ADP-ribosyltransferase PARP10
Type:n/a
Mol. Mass.:109953.63
Organism:Homo sapiens (Human)
Description:Q53GL7
Residue:1025
BDBM50339016
NameBDBM50339016
Synonyms:3,4-dihydroisoquinolin-1(2H)-one | CHEMBL1688212
TypeSmall organic molecule
Emp. Form.C9H9NO
Mol. Mass.147.1739
SMILESO=C1NCCc2ccccc12