Reaction Details
TargetProton-coupled folate transporter
LigandBDBM50126173
Substrate/Competitorn/a
Meas. Tech.ChEMBL_1523805 (CHEMBL3632256)
IC50>1000±n/a nM
Citation Wang, LWallace, ARaghavan, SDeis, SMWilson, MRYang, SPolin, LWhite, KKushner, JOrr, SGeorge, CO'Connor, CHou, ZMitchell-Ryan, SDann, CEMatherly, LHGangjee, A 6-Substituted Pyrrolo[2,3-d]pyrimidine Thienoyl Regioisomers as Targeted Antifolates for Folate Receptora and the Proton-Coupled Folate Transporter in Human Tumors. J Med Chem58:6938-59 (2015) 
 
Proton-coupled folate transporter
Name:Proton-coupled folate transporter
Type:PROTEIN
Mol. Mass.:49782.13
Organism:Homo sapiens (Human)
Description:ChEMBL_1469597
Residue:459
BDBM50126173
NameBDBM50126173
Synonyms:CHEMBL3628345
TypeSmall organic molecule
Emp. Form.C19H21N5O6S
Mol. Mass.447.465
SMILESNc1nc(N)c2c(CCCc3csc(c3)C(=O)N[C@@H](CCC(O)=O)C(O)=O)coc2n1