Reaction Details
TargetEpidermal growth factor receptor
LigandBDBM5447
Substrate/Competitorn/a
Meas. Tech.ChEMBL_1523969 (CHEMBL3630441)
IC50 22±n/a nM
Citation Salerno, SMarini, AMFornaciari, GSimorini, FLa Motta, CTaliani, SSartini, SDa Settimo, FGarcía-Argáez, ANGia, OCosconati, SNovellino, ED'Ocon, PFioravanti, AOrlandi, PBocci, GDalla Via, L Investigation of new 2-aryl substituted Benzothiopyrano[4,3-d]pyrimidines as kinase inhibitors targeting vascular endothelial growth factor receptor 2. Eur J Med Chem103:29-43 (2015) 
 
Epidermal growth factor receptor
Name:Epidermal growth factor receptor
Type:Receptor Kinase Domain
Mol. Mass.:134279.59
Organism:Homo sapiens (Human)
Description:P00533
Residue:1210
BDBM5447
NameBDBM5447
Synonyms:CHEMBL939 Iressa N-(3-chloro-4-fluorophenyl)-7-methoxy-6-[3-(morpholin-4-yl)propoxy]quinazolin-4-amine US10507209, Compound Gefitinib US9730934, Gefitinib WO2022090481, Example gefitinib cid_123631
TypeSmall organic molecule
Emp. Form.C22H24ClFN4O3
Mol. Mass.446.902
SMILESCOc1cc2ncnc(Nc3ccc(F)c(Cl)c3)c2cc1OCCCN1CCOCC1