Reaction Details
TargetCoagulation factor IX
LigandBDBM50126918
Substrate/Competitorn/a
Meas. Tech.ChEMBL_1524004 (CHEMBL3630476)
Ki 8.6±n/a nM
Citation Meng, DAndre, PBateman, TJBerger, RChen, YHDesai, KDewnani, SEllsworth, KFeng, DGeissler, WMGuo, LHruza, AJian, TLi, HMetzger, JParker, DLReichert, PSherer, ECSmith, CJSonatore, LMTschirret-Guth, RWu, JXu, JZhang, TCampeau, LCOrr, RPoirier, MMcCabe-Dunn, JAraki, KNishimura, TSakurada, IHirabayashi, TWood, HB Development of a novel tricyclic class of potent and selective FIXa inhibitors. Bioorg Med Chem Lett25:5437-43 (2015) 
 
Coagulation factor IX
Name:Coagulation factor IX
Type:Enzyme
Mol. Mass.:51768.83
Organism:Homo sapiens (Human)
Description:P00740
Residue:461
BDBM50126918
NameBDBM50126918
Synonyms:CHEMBL3629113
TypeSmall organic molecule
Emp. Form.C28H22Cl2N6O3
Mol. Mass.561.419
SMILESCc1ccc2n3C[C@@](CCc3c(C(O)=O)c2c1)(NC(=O)c1c(Cl)cc(cc1Cl)-n1cnnn1)c1ccccc1