Reaction Details
TargetCoagulation factor IX
LigandBDBM50126924
Substrate/Competitorn/a
Meas. Tech.ChEMBL_1524004 (CHEMBL3630476)
Ki 268±n/a nM
Citation Meng, DAndre, PBateman, TJBerger, RChen, YHDesai, KDewnani, SEllsworth, KFeng, DGeissler, WMGuo, LHruza, AJian, TLi, HMetzger, JParker, DLReichert, PSherer, ECSmith, CJSonatore, LMTschirret-Guth, RWu, JXu, JZhang, TCampeau, LCOrr, RPoirier, MMcCabe-Dunn, JAraki, KNishimura, TSakurada, IHirabayashi, TWood, HB Development of a novel tricyclic class of potent and selective FIXa inhibitors. Bioorg Med Chem Lett25:5437-43 (2015) 
 
Coagulation factor IX
Name:Coagulation factor IX
Type:Enzyme
Mol. Mass.:51768.83
Organism:Homo sapiens (Human)
Description:P00740
Residue:461
BDBM50126924
NameBDBM50126924
Synonyms:CHEMBL3628833
TypeSmall organic molecule
Emp. Form.C24H23Cl2N5O
Mol. Mass.468.378
SMILESCc1ncn(n1)-c1cc(Cl)c(C(=O)N[C@]2(C)CCc3[nH]c4c(C)cccc4c3C2)c(Cl)c1