Reaction Details
TargetCoagulation factor X
LigandBDBM50126944
Substrate/Competitorn/a
Meas. Tech.ChEMBL_1524005 (CHEMBL3630477)
Ki 1682±n/a nM
Citation Meng, DAndre, PBateman, TJBerger, RChen, YHDesai, KDewnani, SEllsworth, KFeng, DGeissler, WMGuo, LHruza, AJian, TLi, HMetzger, JParker, DLReichert, PSherer, ECSmith, CJSonatore, LMTschirret-Guth, RWu, JXu, JZhang, TCampeau, LCOrr, RPoirier, MMcCabe-Dunn, JAraki, KNishimura, TSakurada, IHirabayashi, TWood, HB Development of a novel tricyclic class of potent and selective FIXa inhibitors. Bioorg Med Chem Lett25:5437-43 (2015) 
 
Coagulation factor X
Name:Coagulation factor X
Type:Enzyme
Mol. Mass.:54726.60
Organism:Homo sapiens (Human)
Description:n/a
Residue:488
BDBM50126944
NameBDBM50126944
Synonyms:CHEMBL3628949
TypeSmall organic molecule
Emp. Form.C28H23Cl3N6O
Mol. Mass.565.881
SMILESCc1ncn(n1)-c1cc(Cl)c(C(=O)N[C@@]2(CCc3nn4cc(C)ccc4c3C2)c2cccc(Cl)c2)c(Cl)c1