Reaction Details
TargetCoagulation factor X
LigandBDBM50126916
Substrate/Competitorn/a
Meas. Tech.ChEMBL_1524005 (CHEMBL3630477)
Ki 234±n/a nM
Citation Meng, DAndre, PBateman, TJBerger, RChen, YHDesai, KDewnani, SEllsworth, KFeng, DGeissler, WMGuo, LHruza, AJian, TLi, HMetzger, JParker, DLReichert, PSherer, ECSmith, CJSonatore, LMTschirret-Guth, RWu, JXu, JZhang, TCampeau, LCOrr, RPoirier, MMcCabe-Dunn, JAraki, KNishimura, TSakurada, IHirabayashi, TWood, HB Development of a novel tricyclic class of potent and selective FIXa inhibitors. Bioorg Med Chem Lett25:5437-43 (2015) 
 
Coagulation factor X
Name:Coagulation factor X
Type:Enzyme
Mol. Mass.:54726.60
Organism:Homo sapiens (Human)
Description:n/a
Residue:488
BDBM50126916
NameBDBM50126916
Synonyms:CHEMBL3629111 | US10351558, Example 139
TypeSmall organic molecule
Emp. Form.C29H24ClN5O3
Mol. Mass.525.986
SMILESCc1ccc2n3C[C@@](CCc3c(C(O)=O)c2c1)(NC(=O)c1ccc(cc1Cl)-n1cnnc1)c1ccccc1