Reaction Details
TargetHydroxyacylglutathione hydrolase, mitochondrial
LigandBDBM50092824
Substrate/Competitorn/a
Meas. Tech.ChEMBL_1524149 (CHEMBL3631234)
Ki 1700±n/a nM
Citation Sang, YShi, QMo, MNi, CLi, ZLiu, BDeng, QCreighton, DJZheng, ZB Novel bivalent inhibitors with sub-nanomolar affinities towards human glyoxalase I. Bioorg Med Chem Lett25:4724-7 (2015) 
 
Hydroxyacylglutathione hydrolase, mitochondrial
Name:Hydroxyacylglutathione hydrolase, mitochondrial
Type:PROTEIN
Mol. Mass.:34097.41
Organism:Bos taurus
Description:ChEMBL_109913
Residue:308
BDBM50092824
NameBDBM50092824
Synonyms:CHEMBL131578 | S-(N-4chlorophenyl-N-hydroxycarbamoyl)glutathione
TypeSmall organic molecule
Emp. Form.C17H21ClN4O8S
Mol. Mass.476.889
SMILESN[C@@H](CCC(=O)N[C@@H](CSC(=O)N(O)c1ccc(Cl)cc1)C(=O)NCC(O)=O)C(O)=O