Reaction Details
Target17-beta-hydroxysteroid dehydrogenase type 2
LigandBDBM50126970
Substrate/Competitorn/a
Meas. Tech.ChEMBL_1524156 (CHEMBL3631241)
IC50 25±n/a nM
Citation Abdelsamie, ASBey, EGargano, EMvan Koppen, CJEmpting, MFrotscher, M Towards the evaluation in an animal disease model: Fluorinated 17ß-HSD1 inhibitors showing strong activity towards both the human and the rat enzyme. Eur J Med Chem103:56-68 (2015) 
 
17-beta-hydroxysteroid dehydrogenase type 2
Name:17-beta-hydroxysteroid dehydrogenase type 2
Type:Oxidoreductase; single-pass type II membrane protein
Mol. Mass.:42795.29
Organism:Homo sapiens (Human)
Description:Enzyme was partially purified from human placenta.
Residue:387
BDBM50126970
NameBDBM50126970
Synonyms:CHEMBL3629584
TypeSmall organic molecule
Emp. Form.C17H11F2NO2S
Mol. Mass.331.337
SMILESNc1cccc(c1)-c1ccc(s1)C(=O)c1c(F)ccc(O)c1F