Reaction Details
Target17-beta-hydroxysteroid dehydrogenase type 2
LigandBDBM50126972
Substrate/Competitorn/a
Meas. Tech.ChEMBL_1524156 (CHEMBL3631241)
IC50 13±n/a nM
Citation Abdelsamie, ASBey, EGargano, EMvan Koppen, CJEmpting, MFrotscher, M Towards the evaluation in an animal disease model: Fluorinated 17ß-HSD1 inhibitors showing strong activity towards both the human and the rat enzyme. Eur J Med Chem103:56-68 (2015) 
 
17-beta-hydroxysteroid dehydrogenase type 2
Name:17-beta-hydroxysteroid dehydrogenase type 2
Type:Oxidoreductase; single-pass type II membrane protein
Mol. Mass.:42795.29
Organism:Homo sapiens (Human)
Description:Enzyme was partially purified from human placenta.
Residue:387
BDBM50126972
NameBDBM50126972
Synonyms:CHEMBL3629586
TypeSmall organic molecule
Emp. Form.C24H14F5NO5S2
Mol. Mass.555.494
SMILESOc1ccc(F)c(C(=O)c2ccc(s2)-c2cccc(NS(=O)(=O)c3ccccc3OC(F)(F)F)c2)c1F