Reaction Details
Target17-beta-hydroxysteroid dehydrogenase type 1
LigandBDBM50126985
Substrate/Competitorn/a
Meas. Tech.ChEMBL_1524155 (CHEMBL3631240)
IC50 39±n/a nM
Citation Abdelsamie, ASBey, EGargano, EMvan Koppen, CJEmpting, MFrotscher, M Towards the evaluation in an animal disease model: Fluorinated 17ß-HSD1 inhibitors showing strong activity towards both the human and the rat enzyme. Eur J Med Chem103:56-68 (2015) 
 
17-beta-hydroxysteroid dehydrogenase type 1
Name:17-beta-hydroxysteroid dehydrogenase type 1
Type:Enzyme
Mol. Mass.:34945.13
Organism:Homo sapiens (Human)
Description:P14061
Residue:328
BDBM50126985
NameBDBM50126985
Synonyms:CHEMBL3629441
TypeSmall organic molecule
Emp. Form.C21H15NO4S3
Mol. Mass.441.543
SMILESOc1cccc(c1)C(=O)c1ccc(s1)-c1cccc(NS(=O)(=O)c2cccs2)c1