Reaction Details
Target17-beta-hydroxysteroid dehydrogenase type 1
LigandBDBM50126973
Substrate/Competitorn/a
Meas. Tech.ChEMBL_1524155 (CHEMBL3631240)
IC50 2.0±n/a nM
Citation Abdelsamie, ASBey, EGargano, EMvan Koppen, CJEmpting, MFrotscher, M Towards the evaluation in an animal disease model: Fluorinated 17ß-HSD1 inhibitors showing strong activity towards both the human and the rat enzyme. Eur J Med Chem103:56-68 (2015) 
 
17-beta-hydroxysteroid dehydrogenase type 1
Name:17-beta-hydroxysteroid dehydrogenase type 1
Type:Enzyme
Mol. Mass.:34945.13
Organism:Homo sapiens (Human)
Description:P14061
Residue:328
BDBM50126973
NameBDBM50126973
Synonyms:CHEMBL3629587
TypeSmall organic molecule
Emp. Form.C24H14F5NO4S2
Mol. Mass.539.494
SMILESOc1ccc(F)c(C(=O)c2ccc(s2)-c2cccc(NS(=O)(=O)c3ccccc3C(F)(F)F)c2)c1F