Reaction Details
Target17-beta-hydroxysteroid dehydrogenase type 1
LigandBDBM50127000
Substrate/Competitorn/a
Meas. Tech.ChEMBL_1524155 (CHEMBL3631240)
IC50 46±n/a nM
Citation Abdelsamie, ASBey, EGargano, EMvan Koppen, CJEmpting, MFrotscher, M Towards the evaluation in an animal disease model: Fluorinated 17ß-HSD1 inhibitors showing strong activity towards both the human and the rat enzyme. Eur J Med Chem103:56-68 (2015) 
 
17-beta-hydroxysteroid dehydrogenase type 1
Name:17-beta-hydroxysteroid dehydrogenase type 1
Type:Enzyme
Mol. Mass.:34945.13
Organism:Homo sapiens (Human)
Description:P14061
Residue:328
BDBM50127000
NameBDBM50127000
Synonyms:CHEMBL1277430
TypeSmall organic molecule
Emp. Form.C18H14O3S
Mol. Mass.310.367
SMILESCc1ccc(cc1O)C(=O)c1ccc(s1)-c1cccc(O)c1