Reaction Details
Target17-beta-hydroxysteroid dehydrogenase type 1
LigandBDBM50385880
Substrate/Competitorn/a
Meas. Tech.ChEMBL_1524155 (CHEMBL3631240)
IC50 21±n/a nM
Citation Abdelsamie, ASBey, EGargano, EMvan Koppen, CJEmpting, MFrotscher, M Towards the evaluation in an animal disease model: Fluorinated 17ß-HSD1 inhibitors showing strong activity towards both the human and the rat enzyme. Eur J Med Chem103:56-68 (2015) 
 
17-beta-hydroxysteroid dehydrogenase type 1
Name:17-beta-hydroxysteroid dehydrogenase type 1
Type:Enzyme
Mol. Mass.:34945.13
Organism:Homo sapiens (Human)
Description:P14061
Residue:328
BDBM50385880
NameBDBM50385880
Synonyms:CHEMBL2041368
TypeSmall organic molecule
Emp. Form.C29H20N2O4S
Mol. Mass.492.545
SMILESOc1cccc(c1)-c1ccc2c(c(O)ccc2c1)-c1cccc(NS(=O)(=O)c2cccc(c2)C#N)c1