Reaction Details
TargetMitogen-activated protein kinase 1
LigandBDBM50205363
Substrate/Competitorn/a
Meas. Tech.ChEMBL_1524687 (CHEMBL3631081)
Kd 247000±n/a nM
Citation Burdick, DJWang, SHeise, CPan, BDrummond, JYin, JGoeser, LMagnuson, SBlaney, JMoffat, JWang, WChen, H Fragment-based discovery of potent ERK2 pyrrolopyrazine inhibitors. Bioorg Med Chem Lett25:4728-32 (2015) 
 
Mitogen-activated protein kinase 1
Name:Mitogen-activated protein kinase 1
Type:Ser/Thr Protein Kinase
Mol. Mass.:41392.76
Organism:Homo sapiens (Human)
Description:P28482
Residue:360
BDBM50205363
NameBDBM50205363
Synonyms:6-(benzylamino)purine 6-[(phenylmethyl)amino]-9H-purine CHEMBL228862 N(6)-(benzylamino)purine N-benzyladenine | benzyladenine
TypeSmall organic molecule
Emp. Form.C12H11N5
Mol. Mass.225.2492
SMILESC(Nc1ncnc2nc[nH]c12)c1ccccc1