Reaction Details
TargetMitogen-activated protein kinase 1
LigandBDBM50127013
Substrate/Competitorn/a
Meas. Tech.ChEMBL_1524688 (CHEMBL3631082)
IC50>200000±n/a nM
Citation Burdick, DJWang, SHeise, CPan, BDrummond, JYin, JGoeser, LMagnuson, SBlaney, JMoffat, JWang, WChen, H Fragment-based discovery of potent ERK2 pyrrolopyrazine inhibitors. Bioorg Med Chem Lett25:4728-32 (2015) 
 
Mitogen-activated protein kinase 1
Name:Mitogen-activated protein kinase 1
Type:Ser/Thr Protein Kinase
Mol. Mass.:41392.76
Organism:Homo sapiens (Human)
Description:P28482
Residue:360
BDBM50127013
NameBDBM50127013
Synonyms:CHEMBL3628247
TypeSmall organic molecule
Emp. Form.C6H4BrN3
Mol. Mass.198.02
SMILESBrc1cnc2[nH]ccc2n1