Reaction Details
TargetMitogen-activated protein kinase 1
LigandBDBM50127021
Substrate/Competitorn/a
Meas. Tech.ChEMBL_1524688 (CHEMBL3631082)
IC50 50100±n/a nM
Citation Burdick, DJWang, SHeise, CPan, BDrummond, JYin, JGoeser, LMagnuson, SBlaney, JMoffat, JWang, WChen, H Fragment-based discovery of potent ERK2 pyrrolopyrazine inhibitors. Bioorg Med Chem Lett25:4728-32 (2015) 
 
Mitogen-activated protein kinase 1
Name:Mitogen-activated protein kinase 1
Type:Ser/Thr Protein Kinase
Mol. Mass.:41392.76
Organism:Homo sapiens (Human)
Description:P28482
Residue:360
BDBM50127021
NameBDBM50127021
Synonyms:CHEMBL3628249
TypeSmall organic molecule
Emp. Form.C12H9N3
Mol. Mass.195.22
SMILESc1cc2nc(cnc2[nH]1)-c1ccccc1