Reaction Details
TargetMitogen-activated protein kinase 1
LigandBDBM50127023
Substrate/Competitorn/a
Meas. Tech.ChEMBL_1524688 (CHEMBL3631082)
IC50>200000±n/a nM
Citation Burdick, DJWang, SHeise, CPan, BDrummond, JYin, JGoeser, LMagnuson, SBlaney, JMoffat, JWang, WChen, H Fragment-based discovery of potent ERK2 pyrrolopyrazine inhibitors. Bioorg Med Chem Lett25:4728-32 (2015) 
 
Mitogen-activated protein kinase 1
Name:Mitogen-activated protein kinase 1
Type:Ser/Thr Protein Kinase
Mol. Mass.:41392.76
Organism:Homo sapiens (Human)
Description:P28482
Residue:360
BDBM50127023
NameBDBM50127023
Synonyms:CHEMBL3628251
TypeSmall organic molecule
Emp. Form.C12H9N3O
Mol. Mass.211.2194
SMILESOc1cccc(c1)-c1cnc2[nH]ccc2n1