Reaction Details
TargetMitogen-activated protein kinase 1
LigandBDBM50127028
Substrate/Competitorn/a
Meas. Tech.ChEMBL_1524688 (CHEMBL3631082)
IC50 11700±n/a nM
Citation Burdick, DJWang, SHeise, CPan, BDrummond, JYin, JGoeser, LMagnuson, SBlaney, JMoffat, JWang, WChen, H Fragment-based discovery of potent ERK2 pyrrolopyrazine inhibitors. Bioorg Med Chem Lett25:4728-32 (2015) 
 
Mitogen-activated protein kinase 1
Name:Mitogen-activated protein kinase 1
Type:Ser/Thr Protein Kinase
Mol. Mass.:41392.76
Organism:Homo sapiens (Human)
Description:P28482
Residue:360
BDBM50127028
NameBDBM50127028
Synonyms:CHEMBL3628256
TypeSmall organic molecule
Emp. Form.C11H8N4
Mol. Mass.196.208
SMILESc1cc2nc(cnc2[nH]1)-c1ccncc1