Reaction Details
TargetMitogen-activated protein kinase 1
LigandBDBM50127029
Substrate/Competitorn/a
Meas. Tech.ChEMBL_1524688 (CHEMBL3631082)
IC50 21600±n/a nM
Citation Burdick, DJWang, SHeise, CPan, BDrummond, JYin, JGoeser, LMagnuson, SBlaney, JMoffat, JWang, WChen, H Fragment-based discovery of potent ERK2 pyrrolopyrazine inhibitors. Bioorg Med Chem Lett25:4728-32 (2015) 
 
Mitogen-activated protein kinase 1
Name:Mitogen-activated protein kinase 1
Type:Ser/Thr Protein Kinase
Mol. Mass.:41392.76
Organism:Homo sapiens (Human)
Description:P28482
Residue:360
BDBM50127029
NameBDBM50127029
Synonyms:CHEMBL3628257
TypeSmall organic molecule
Emp. Form.C11H7FN4
Mol. Mass.214.1985
SMILESFc1cc(ccn1)-c1cnc2[nH]ccc2n1