Reaction Details
TargetTryptophan 2,3-dioxygenase
LigandBDBM50127156
Substrate/Competitorn/a
Meas. Tech.ChEMBL_1524691 (CHEMBL3631085)
IC50 1586±n/a nM
Citation Wu, JSLin, SYLiao, FYHsiao, WCLee, LCPeng, YHHsieh, CLWu, MHSong, JSYueh, AChen, CHYeh, SHLiu, CYLin, SYYeh, TKHsu, JTShih, CUeng, SHHung, MSWu, SY Identification of Substituted Naphthotriazolediones as Novel Tryptophan 2,3-Dioxygenase (TDO) Inhibitors through Structure-Based Virtual Screening. J Med Chem58:7807-19 (2015) 
 
Tryptophan 2,3-dioxygenase
Name:Tryptophan 2,3-dioxygenase
Type:PROTEIN
Mol. Mass.:47874.48
Organism:Homo sapiens (Human)
Description:ChEMBL_825691
Residue:406
BDBM50127156
NameBDBM50127156
Synonyms:CHEMBL3628555
TypeSmall organic molecule
Emp. Form.C17H10BrN3O2
Mol. Mass.368.184
SMILESBrc1ccc(Cn2nnc3c2C(=O)c2ccccc2C3=O)cc1