Reaction Details
TargetTryptophan 2,3-dioxygenase
LigandBDBM50127157
Substrate/Competitorn/a
Meas. Tech.ChEMBL_1524691 (CHEMBL3631085)
IC50 6460±n/a nM
Citation Wu, JSLin, SYLiao, FYHsiao, WCLee, LCPeng, YHHsieh, CLWu, MHSong, JSYueh, AChen, CHYeh, SHLiu, CYLin, SYYeh, TKHsu, JTShih, CUeng, SHHung, MSWu, SY Identification of Substituted Naphthotriazolediones as Novel Tryptophan 2,3-Dioxygenase (TDO) Inhibitors through Structure-Based Virtual Screening. J Med Chem58:7807-19 (2015) 
 
Tryptophan 2,3-dioxygenase
Name:Tryptophan 2,3-dioxygenase
Type:PROTEIN
Mol. Mass.:47874.48
Organism:Homo sapiens (Human)
Description:ChEMBL_825691
Residue:406
BDBM50127157
NameBDBM50127157
Synonyms:CHEMBL3628556
TypeSmall organic molecule
Emp. Form.C17H10ClN3O2
Mol. Mass.323.733
SMILESClc1ccc(Cn2nnc3c2C(=O)c2ccccc2C3=O)cc1